Reaction Details
TargetMast/stem cell growth factor receptor Kit
LigandBDBM50384726
Substrate/Competitorn/a
Meas. Tech.ChEMBL_820937 (CHEMBL2038982)
IC50 21±n/a nM
Citation Albaugh, PFan, YMi, YSun, FAdrian, FLi, NJia, YSarkisova, YKreusch, AHood, TLu, MLiu, GHuang, SLiu, ZLoren, JTuntland, TKaranewsky, DSSeidel, HMMolteni, V Discovery of GNF-5837, a Selective TRK Inhibitor with Efficacy in Rodent Cancer Tumor Models. ACS Med Chem Lett3:140-145 (2012) 
 
Mast/stem cell growth factor receptor Kit
Name:Mast/stem cell growth factor receptor Kit
Type:PROTEIN
Mol. Mass.:109349.62
Organism:Mus musculus
Description:ChEMBL_1348201
Residue:979
BDBM50384726
NameBDBM50384726
Synonyms:CHEMBL2037208
TypeSmall organic molecule
Emp. Form.C27H19F3N4O2
Mol. Mass.488.4606
SMILESFC(F)(F)c1cccc(c1)C(=O)Nc1cccc(Nc2ccc3\C(=C\c4ccc[nH]4)C(=O)Nc3c2)c1