Reaction Details
TargetTyrosine-protein kinase receptor Tie-1
LigandBDBM50384727
Substrate/Competitorn/a
Meas. Tech.ChEMBL_821006 (CHEMBL2039193)
IC50 5700±n/a nM
Citation Albaugh, PFan, YMi, YSun, FAdrian, FLi, NJia, YSarkisova, YKreusch, AHood, TLu, MLiu, GHuang, SLiu, ZLoren, JTuntland, TKaranewsky, DSSeidel, HMMolteni, V Discovery of GNF-5837, a Selective TRK Inhibitor with Efficacy in Rodent Cancer Tumor Models. ACS Med Chem Lett3:140-145 (2012) 
 
Tyrosine-protein kinase receptor Tie-1
Name:Tyrosine-protein kinase receptor Tie-1
Type:PROTEIN
Mol. Mass.:124588.36
Organism:Mus musculus
Description:ChEMBL_821006
Residue:1134
BDBM50384727
NameBDBM50384727
Synonyms:CHEMBL2037226
TypeSmall organic molecule
Emp. Form.C28H21F4N5O2
Mol. Mass.535.4923
SMILESCc1ccc(NC(=O)Nc2cc(ccc2F)C(F)(F)F)cc1Nc1ccc2\C(=C\c3ccc[nH]3)C(=O)Nc2c1