Reaction Details
TargetEphrin type-B receptor 2
LigandBDBM50384726
Substrate/Competitorn/a
Meas. Tech.ChEMBL_820927 (CHEMBL2038868)
IC50 2400±n/a nM
Citation Albaugh, PFan, YMi, YSun, FAdrian, FLi, NJia, YSarkisova, YKreusch, AHood, TLu, MLiu, GHuang, SLiu, ZLoren, JTuntland, TKaranewsky, DSSeidel, HMMolteni, V Discovery of GNF-5837, a Selective TRK Inhibitor with Efficacy in Rodent Cancer Tumor Models. ACS Med Chem Lett3:140-145 (2012) 
 
Ephrin type-B receptor 2
Name:Ephrin type-B receptor 2
Type:PROTEIN
Mol. Mass.:109887.41
Organism:Mus musculus
Description:ChEMBL_101390
Residue:986
BDBM50384726
NameBDBM50384726
Synonyms:CHEMBL2037208
TypeSmall organic molecule
Emp. Form.C27H19F3N4O2
Mol. Mass.488.4606
SMILESFC(F)(F)c1cccc(c1)C(=O)Nc1cccc(Nc2ccc3\C(=C\c4ccc[nH]4)C(=O)Nc3c2)c1