Reaction Details
TargetRegulator of G-protein signaling 8
LigandBDBM50384748
Substrate/Competitorn/a
Meas. Tech.ChEMBL_821036 (CHEMBL2039223)
IC50 16400±n/a nM
Citation Turner, EMBlazer, LLNeubig, RRHusbands, SM Small Molecule Inhibitors of Regulator of G Protein Signalling (RGS) Proteins. ACS Med Chem Lett3:146-150 (2012) 
 
Regulator of G-protein signaling 8
Name:Regulator of G-protein signaling 8
Type:Enzyme Catalytic Domain
Mol. Mass.:20925.80
Organism:Homo sapiens (Human)
Description:gi_74355113
Residue:180
BDBM50384748
NameBDBM50384748
Synonyms:CHEMBL2037347
TypeSmall organic molecule
Emp. Form.C16H11F3N2O2S
Mol. Mass.352.331
SMILESFC(F)(F)c1cccc(c1)-n1sc(=O)n(Cc2ccccc2)c1=O