Reaction Details
TargetRegulator of G-protein signaling 8
LigandBDBM50384751
Substrate/Competitorn/a
Meas. Tech.ChEMBL_821036 (CHEMBL2039223)
IC50 20400±n/a nM
Citation Turner, EMBlazer, LLNeubig, RRHusbands, SM Small Molecule Inhibitors of Regulator of G Protein Signalling (RGS) Proteins. ACS Med Chem Lett3:146-150 (2012) 
 
Regulator of G-protein signaling 8
Name:Regulator of G-protein signaling 8
Type:Enzyme Catalytic Domain
Mol. Mass.:20925.80
Organism:Homo sapiens (Human)
Description:gi_74355113
Residue:180
BDBM50384751
NameBDBM50384751
Synonyms:CHEMBL2037350
TypeSmall organic molecule
Emp. Form.C17H16N2O2S
Mol. Mass.312.386
SMILESCc1ccc(Cn2sc(=O)n(Cc3ccccc3)c2=O)cc1