Reaction Details
TargetRegulator of G-protein signaling 4
LigandBDBM50384753
Substrate/Competitorn/a
Meas. Tech.ChEMBL_821035 (CHEMBL2039222)
IC50 28±n/a nM
Citation Turner, EMBlazer, LLNeubig, RRHusbands, SM Small Molecule Inhibitors of Regulator of G Protein Signalling (RGS) Proteins. ACS Med Chem Lett3:146-150 (2012) 
 
Regulator of G-protein signaling 4
Name:Regulator of G-protein signaling 4
Type:Enzyme
Mol. Mass.:23263.51
Organism:Homo sapiens (Human)
Description:P49798
Residue:205
BDBM50384753
NameBDBM50384753
Synonyms:CHEMBL2037361
TypeSmall organic molecule
Emp. Form.C7H12N2O2S
Mol. Mass.188.247
SMILESCn1c(=O)sn(c1=O)C(C)(C)C