Reaction Details
TargetRegulator of G-protein signaling 4
LigandBDBM50384749
Substrate/Competitorn/a
Meas. Tech.ChEMBL_821035 (CHEMBL2039222)
IC50 38±n/a nM
Citation Turner, EMBlazer, LLNeubig, RRHusbands, SM Small Molecule Inhibitors of Regulator of G Protein Signalling (RGS) Proteins. ACS Med Chem Lett3:146-150 (2012) 
 
Regulator of G-protein signaling 4
Name:Regulator of G-protein signaling 4
Type:Enzyme
Mol. Mass.:23263.51
Organism:Homo sapiens (Human)
Description:P49798
Residue:205
BDBM50384749
NameBDBM50384749
Synonyms:CHEMBL2037348
TypeSmall organic molecule
Emp. Form.C16H14N2O2S
Mol. Mass.298.36
SMILESCc1cccc(c1)-n1sc(=O)n(Cc2ccccc2)c1=O