Reaction Details
TargetRegulator of G-protein signaling 4
LigandBDBM7779
Substrate/Competitorn/a
Meas. Tech.ChEMBL_821035 (CHEMBL2039222)
IC50 14±n/a nM
Citation Turner, EMBlazer, LLNeubig, RRHusbands, SM Small Molecule Inhibitors of Regulator of G Protein Signalling (RGS) Proteins. ACS Med Chem Lett3:146-150 (2012) 
 
Regulator of G-protein signaling 4
Name:Regulator of G-protein signaling 4
Type:Enzyme
Mol. Mass.:23263.51
Organism:Homo sapiens (Human)
Description:P49798
Residue:205
BDBM7779
NameBDBM7779
Synonyms:4-butyl-2-ethyl-1,2,4-thiadiazolidine-3,5-dione Thiadiazolidinone (TDZD) deriv. 6
TypeSmall organic molecule
Emp. Form.C8H14N2O2S
Mol. Mass.202.274
SMILESCCCCn1c(=O)sn(CC)c1=O