Reaction Details
TargetRegulator of G-protein signaling 4
LigandBDBM50384767
Substrate/Competitorn/a
Meas. Tech.ChEMBL_821035 (CHEMBL2039222)
IC50 14±n/a nM
Citation Turner, EMBlazer, LLNeubig, RRHusbands, SM Small Molecule Inhibitors of Regulator of G Protein Signalling (RGS) Proteins. ACS Med Chem Lett3:146-150 (2012) 
 
Regulator of G-protein signaling 4
Name:Regulator of G-protein signaling 4
Type:Enzyme
Mol. Mass.:23263.51
Organism:Homo sapiens (Human)
Description:P49798
Residue:205
BDBM50384767
NameBDBM50384767
Synonyms:CHEMBL2037365
TypeSmall organic molecule
Emp. Form.C13H16N2O2S
Mol. Mass.264.343
SMILESCC(C)Cn1c(=O)sn(-c2ccc(C)cc2)c1=O