Reaction Details
TargetRegulator of G-protein signaling 4
LigandBDBM50384769
Substrate/Competitorn/a
Meas. Tech.ChEMBL_821035 (CHEMBL2039222)
IC50 39±n/a nM
Citation Turner, EMBlazer, LLNeubig, RRHusbands, SM Small Molecule Inhibitors of Regulator of G Protein Signalling (RGS) Proteins. ACS Med Chem Lett3:146-150 (2012) 
 
Regulator of G-protein signaling 4
Name:Regulator of G-protein signaling 4
Type:Enzyme
Mol. Mass.:23263.51
Organism:Homo sapiens (Human)
Description:P49798
Residue:205
BDBM50384769
NameBDBM50384769
Synonyms:CHEMBL2037367
TypeSmall organic molecule
Emp. Form.C10H18N2O2S
Mol. Mass.230.327
SMILESCCCCn1sc(=O)n(CC(C)C)c1=O