Reaction Details
TargetRegulator of G-protein signaling 8
LigandBDBM50384778
Substrate/Competitorn/a
Meas. Tech.ChEMBL_821036 (CHEMBL2039223)
IC50 17200±n/a nM
Citation Turner, EMBlazer, LLNeubig, RRHusbands, SM Small Molecule Inhibitors of Regulator of G Protein Signalling (RGS) Proteins. ACS Med Chem Lett3:146-150 (2012) 
 
Regulator of G-protein signaling 8
Name:Regulator of G-protein signaling 8
Type:Enzyme Catalytic Domain
Mol. Mass.:20925.80
Organism:Homo sapiens (Human)
Description:gi_74355113
Residue:180
BDBM50384778
NameBDBM50384778
Synonyms:CHEMBL2037230
TypeSmall organic molecule
Emp. Form.C15H9Cl2FN2O2S
Mol. Mass.371.214
SMILESFc1ccc(Cn2c(=O)sn(-c3ccc(Cl)c(Cl)c3)c2=O)cc1