Reaction Details
TargetRegulator of G-protein signaling 8
LigandBDBM50384764
Substrate/Competitorn/a
Meas. Tech.ChEMBL_821036 (CHEMBL2039223)
IC50 9500±n/a nM
Citation Turner, EMBlazer, LLNeubig, RRHusbands, SM Small Molecule Inhibitors of Regulator of G Protein Signalling (RGS) Proteins. ACS Med Chem Lett3:146-150 (2012) 
 
Regulator of G-protein signaling 8
Name:Regulator of G-protein signaling 8
Type:Enzyme Catalytic Domain
Mol. Mass.:20925.80
Organism:Homo sapiens (Human)
Description:gi_74355113
Residue:180
BDBM50384764
NameBDBM50384764
Synonyms:CHEMBL2037362
TypeSmall organic molecule
Emp. Form.C13H16N2O2S
Mol. Mass.264.343
SMILESCCCCn1c(=O)sn(-c2ccc(C)cc2)c1=O