Reaction Details
TargetG-protein coupled receptor 35
LigandBDBM14363
Substrate/Competitorn/a
Meas. Tech.ChEMBL_821044 (CHEMBL2039370)
EC50 160±n/a nM
Citation Deng, HHu, HLing, SFerrie, AMFang, Y Discovery of Natural Phenols as G Protein-Coupled Receptor-35 (GPR35) Agonists. ACS Med Chem Lett3:165-169 (2012) 
 
G-protein coupled receptor 35
Name:G-protein coupled receptor 35
Type:Enzyme Catalytic Domain
Mol. Mass.:34085.57
Organism:Homo sapiens (Human)
Description:gi_33695097
Residue:309
BDBM14363
NameBDBM14363
Synonyms:3-(2-propoxyphenyl)-2,4,7,8,9-pentazabicyclo[4.3.0]nona-1,3,6-trien-5-one Tocris-0947 | Zaprinast
TypeSmall organic molecule
Emp. Form.C13H13N5O2
Mol. Mass.271.2746
SMILESCCCOc1ccccc1-c1nc2nn[nH]c2c(=O)[nH]1