Reaction Details
TargetAdenosine receptor A1
LigandBDBM50163462
Substrate/Competitorn/a
Meas. Tech.ChEMBL_821156 (CHEMBL2039698)
Ki 81.28±n/a nM
Citation Stumpfe, DBajorath, J Exploring activity cliffs in medicinal chemistry. J Med Chem55:2932-42 (2012) 
 
Adenosine receptor A1
Name:Adenosine receptor A1
Type:G Protein-Coupled Receptor (GPCR)
Mol. Mass.:36520.92
Organism:Homo sapiens (Human)
Description:P30542
Residue:326
BDBM50163462
NameBDBM50163462
Synonyms:2-Amino-6-(2-hydroxy-ethylsulfanyl)-4-m-tolyl-pyridine-3,5-dicarbonitrile | CHEMBL179300
TypeSmall organic molecule
Emp. Form.C16H14N4OS
Mol. Mass.310.374
SMILESCc1cccc(c1)-c1c(C#N)c(N)nc(SCCO)c1C#N