Reaction Details
TargetAdenosine receptor A1
LigandBDBM50163452
Substrate/Competitorn/a
Meas. Tech.ChEMBL_821156 (CHEMBL2039698)
Ki 39.81±n/a nM
Citation Stumpfe, DBajorath, J Exploring activity cliffs in medicinal chemistry. J Med Chem55:2932-42 (2012) 
 
Adenosine receptor A1
Name:Adenosine receptor A1
Type:G Protein-Coupled Receptor (GPCR)
Mol. Mass.:36520.92
Organism:Homo sapiens (Human)
Description:P30542
Residue:326
BDBM50163452
NameBDBM50163452
Synonyms:2-Amino-4-(3-fluoro-phenyl)-6-(2-hydroxy-ethylsulfanyl)-pyridine-3,5-dicarbonitrile | CHEMBL179198
TypeSmall organic molecule
Emp. Form.C15H11FN4OS
Mol. Mass.314.337
SMILESNc1nc(SCCO)c(C#N)c(-c2cccc(F)c2)c1C#N