Reaction Details
TargetOxytocin receptor
LigandBDBM50190528
Substrate/Competitorn/a
Meas. Tech.ChEMBL_821157 (CHEMBL2039699)
Ki 0.0794±n/a nM
Citation Borthwick, ADLiddle, JDavies, DEExall, AMHamlett, CHickey, DMMason, AMSmith, IENerozzi, FPeace, SPollard, DSollis, SLAllen, MJWoollard, PMPullen, MAWestfall, TDStanislaus, DJ Pyridyl-2,5-diketopiperazines as potent, selective, and orally bioavailable oxytocin antagonists: synthesis, pharmacokinetics, and in vivo potency. J Med Chem55:783-96 (2012) 
 
Oxytocin receptor
Name:Oxytocin receptor
Type:Enzyme Catalytic Domain
Mol. Mass.:42793.26
Organism:Homo sapiens (Human)
Description:Oxytocin OXTR HEK293::B2R9L7
Residue:389
BDBM50190528
NameBDBM50190528
Synonyms:(2R)-2-(2,4-difluorophenyl)-2-[(3R,6R)-3-(2,3-dihydro-1H-inden-2-yl)-6-(2-methylpropyl)-2,5-dioxo-1-piperazinyl]-N,N-dimethylethanamide | CHEMBL377414
TypeSmall organic molecule
Emp. Form.C27H31F2N3O3
Mol. Mass.483.5501
SMILESCC(C)C[C@H]1N([C@@H](C(=O)N(C)C)c2ccc(F)cc2F)C(=O)[C@H](NC1=O)C1Cc2ccccc2C1