Reaction Details
TargetOxytocin receptor
LigandBDBM50384829
Substrate/Competitorn/a
Meas. Tech.ChEMBL_821172 (CHEMBL2039714)
Ki 15.85±n/a nM
Citation Borthwick, ADLiddle, JDavies, DEExall, AMHamlett, CHickey, DMMason, AMSmith, IENerozzi, FPeace, SPollard, DSollis, SLAllen, MJWoollard, PMPullen, MAWestfall, TDStanislaus, DJ Pyridyl-2,5-diketopiperazines as potent, selective, and orally bioavailable oxytocin antagonists: synthesis, pharmacokinetics, and in vivo potency. J Med Chem55:783-96 (2012) 
 
Oxytocin receptor
Name:Oxytocin receptor
Type:Enzyme Catalytic Domain
Mol. Mass.:42793.26
Organism:Homo sapiens (Human)
Description:Oxytocin OXTR HEK293::B2R9L7
Residue:389
BDBM50384829
NameBDBM50384829
Synonyms:CHEMBL2035011
TypeSmall organic molecule
Emp. Form.C30H39N3O3
Mol. Mass.489.649
SMILESCCc1ccccc1[C@@H](N1[C@H](CC(C)C)C(=O)N[C@H](C2Cc3ccccc3C2)C1=O)C(=O)NC(C)C