Reaction Details
TargetOxytocin receptor
LigandBDBM50384831
Substrate/Competitorn/a
Meas. Tech.ChEMBL_821172 (CHEMBL2039714)
Ki 3.98±n/a nM
Citation Borthwick, ADLiddle, JDavies, DEExall, AMHamlett, CHickey, DMMason, AMSmith, IENerozzi, FPeace, SPollard, DSollis, SLAllen, MJWoollard, PMPullen, MAWestfall, TDStanislaus, DJ Pyridyl-2,5-diketopiperazines as potent, selective, and orally bioavailable oxytocin antagonists: synthesis, pharmacokinetics, and in vivo potency. J Med Chem55:783-96 (2012) 
 
Oxytocin receptor
Name:Oxytocin receptor
Type:Enzyme Catalytic Domain
Mol. Mass.:42793.26
Organism:Homo sapiens (Human)
Description:Oxytocin OXTR HEK293::B2R9L7
Residue:389
BDBM50384831
NameBDBM50384831
Synonyms:CHEMBL2035009
TypeSmall organic molecule
Emp. Form.C28H34ClN3O3
Mol. Mass.496.041
SMILESCC(C)C[C@H]1N([C@@H](C(=O)NC(C)C)c2ccccc2Cl)C(=O)[C@H](NC1=O)C1Cc2ccccc2C1