Reaction Details
TargetOxytocin receptor
LigandBDBM50384838
Substrate/Competitorn/a
Meas. Tech.ChEMBL_821157 (CHEMBL2039699)
Ki 0.0794±n/a nM
Citation Borthwick, ADLiddle, JDavies, DEExall, AMHamlett, CHickey, DMMason, AMSmith, IENerozzi, FPeace, SPollard, DSollis, SLAllen, MJWoollard, PMPullen, MAWestfall, TDStanislaus, DJ Pyridyl-2,5-diketopiperazines as potent, selective, and orally bioavailable oxytocin antagonists: synthesis, pharmacokinetics, and in vivo potency. J Med Chem55:783-96 (2012) 
 
Oxytocin receptor
Name:Oxytocin receptor
Type:Enzyme Catalytic Domain
Mol. Mass.:42793.26
Organism:Homo sapiens (Human)
Description:Oxytocin OXTR HEK293::B2R9L7
Residue:389
BDBM50384838
NameBDBM50384838
Synonyms:CHEMBL2037510
TypeSmall organic molecule
Emp. Form.C28H36N4O3
Mol. Mass.476.6104
SMILESCC[C@H](C)[C@H]1N([C@@H](C(=O)N(C)C)c2ccc(C)nc2C)C(=O)[C@H](NC1=O)C1Cc2ccccc2C1