Reaction Details
TargetReceptor-type tyrosine-protein kinase FLT3
LigandBDBM50384868
Substrate/Competitorn/a
Meas. Tech.ChEMBL_821291 (CHEMBL2040121)
IC50 7.9±n/a nM
Citation William, ADLee, ACPoulsen, AGoh, KCMadan, BHart, STan, EWang, HNagaraj, HChen, DLee, CPSun, ETJayaraman, RPasha, MKEthirajulu, KWood, JMDymock, BW Discovery of the macrocycle (9E)-15-(2-(pyrrolidin-1-yl)ethoxy)-7,12,25-trioxa-19,21,24-triaza-tetracyclo[18.3.1.1(2,5).1(14,18)]hexacosa-1(24),2,4,9,14(26),15,17,20,22-nonaene (SB1578), a potent inhibitor of janus kinase 2/fms-like tyrosine kinase-3 (JAK2/FLT3) for the treatment of rheumatoid arth J Med Chem55:2623-40 (2012) 
 
Receptor-type tyrosine-protein kinase FLT3
Name:Receptor-type tyrosine-protein kinase FLT3
Type:Enzyme
Mol. Mass.:112888.62
Organism:Homo sapiens (Human)
Description:P36888
Residue:993
BDBM50384868
NameBDBM50384868
Synonyms:CHEMBL2035049
TypeSmall organic molecule
Emp. Form.C29H31N5O2
Mol. Mass.481.5887
SMILESC(CN1CCCC1)Oc1ccc2Nc3nccc(n3)-c3ccc4ccn(C\C=C\COCc1c2)c4c3