Reaction Details
TargetVascular endothelial growth factor receptor 1
LigandBDBM50384888
Substrate/Competitorn/a
Meas. Tech.ChEMBL_821812 (CHEMBL2039256)
IC50>3000±n/a nM
Citation Cha, MYLee, KOKang, SJJung, YHSong, JYChoi, KJByun, JYLee, HJLee, GSPark, SBKim, MS Synthesis and biological evaluation of pyrimidine-based dual inhibitors of human epidermal growth factor receptor 1 (HER-1) and HER-2 tyrosine kinases. J Med Chem55:2846-57 (2012) 
 
Vascular endothelial growth factor receptor 1
Name:Vascular endothelial growth factor receptor 1
Type:Receptor Tyrosine Kinase
Mol. Mass.:150800.23
Organism:Homo sapiens (Human)
Description:P17948
Residue:1338
BDBM50384888
NameBDBM50384888
Synonyms:CHEMBL2035810
TypeSmall organic molecule
Emp. Form.C23H20ClN7O3
Mol. Mass.477.903
SMILESNc1ncnc(Nc2ccc(OCc3ccccn3)c(Cl)c2)c1-c1nc(CNC(=O)C=C)co1