Reaction Details
TargetSerine/threonine-protein kinase pim-1
LigandBDBM50384888
Substrate/Competitorn/a
Meas. Tech.ChEMBL_821824 (CHEMBL2039268)
IC50>3000±n/a nM
Citation Cha, MYLee, KOKang, SJJung, YHSong, JYChoi, KJByun, JYLee, HJLee, GSPark, SBKim, MS Synthesis and biological evaluation of pyrimidine-based dual inhibitors of human epidermal growth factor receptor 1 (HER-1) and HER-2 tyrosine kinases. J Med Chem55:2846-57 (2012) 
 
Serine/threonine-protein kinase pim-1
Name:Serine/threonine-protein kinase pim-1
Type:Protein
Mol. Mass.:35681.82
Organism:Homo sapiens (Human)
Description:P11309
Residue:313
BDBM50384888
NameBDBM50384888
Synonyms:CHEMBL2035810
TypeSmall organic molecule
Emp. Form.C23H20ClN7O3
Mol. Mass.477.903
SMILESNc1ncnc(Nc2ccc(OCc3ccccn3)c(Cl)c2)c1-c1nc(CNC(=O)C=C)co1