Reaction Details
TargetAcetylcholinesterase
LigandBDBM8961
Substrate/Competitorn/a
Meas. Tech.ChEMBL_820325 (CHEMBL2037747)
IC50 64.57±n/a nM
Citation Wang, YGuan, XLWu, PFWang, CMCao, HLi, LGuo, XJWang, FXie, NJiang, FCChen, JG Multifunctional mercapto-tacrine derivatives for treatment of age-related neurodegenerative diseases. J Med Chem55:3588-92 (2012) 
 
Acetylcholinesterase
Name:Acetylcholinesterase
Type:Enzyme
Mol. Mass.:71812.79
Organism:Electrophorus electricus (Electric eel)
Description:n/a
Residue:633
BDBM8961
NameBDBM8961
Synonyms:1,2,3,4-tetrahydro-9-acridinamine 9-THA CHEMBL1337960 Cognex Tracine cid_1935 | tacrine.HCl
TypeSmall organic molecule
Emp. Form.C13H14N2
Mol. Mass.198.2637
SMILESNc1c2CCCCc2nc2ccccc12