Reaction Details
TargetCholinesterase
LigandBDBM50384890
Substrate/Competitorn/a
Meas. Tech.ChEMBL_820326 (CHEMBL2037748)
IC50 177.83±n/a nM
Citation Wang, YGuan, XLWu, PFWang, CMCao, HLi, LGuo, XJWang, FXie, NJiang, FCChen, JG Multifunctional mercapto-tacrine derivatives for treatment of age-related neurodegenerative diseases. J Med Chem55:3588-92 (2012) 
 
Cholinesterase
Name:Cholinesterase
Type:Enzyme
Mol. Mass.:65643.35
Organism:Equus caballus (Horse)
Description:P81908
Residue:574
BDBM50384890
NameBDBM50384890
Synonyms:CHEMBL2036263
TypeSmall organic molecule
Emp. Form.C22H30ClN3OS
Mol. Mass.420.011
SMILESSCCC(=O)NCCCCCCNc1c2CCCCc2nc2cc(Cl)ccc12