Reaction Details
TargetSodium-dependent noradrenaline transporter
LigandBDBM50176062
Substrate/Competitorn/a
Meas. Tech.ChEMBL_820352 (CHEMBL2037695)
Ki 2±n/a nM
Citation Mladenova, GAnnedi, SCRamnauth, JMaddaford, SPRakhit, SAndrews, JSZhang, DPorreca, F First-in-class, dual-action, 3,5-disubstituted indole derivatives having human nitric oxide synthase (nNOS) and norepinephrine reuptake inhibitory (NERI) activity for the treatment of neuropathic pain. J Med Chem55:3488-501 (2012) 
 
Sodium-dependent noradrenaline transporter
Name:Sodium-dependent noradrenaline transporter
Type:Multi-pass membrane protein
Mol. Mass.:69337.72
Organism:Homo sapiens (Human)
Description:P23975
Residue:617
BDBM50176062
NameBDBM50176062
Synonyms:3-(5H-dibenzo[a,d][7]annulen-5-yl)-N-methylpropan-1-amine 5-(3-methylaminopropyl)-5H-dibenzo[a,d]cycloheptene CHEMBL668 N-methyl-5H-dibenzo[a,d]cycloheptene-5-propylamine amimetilina
TypeSmall organic molecule
Emp. Form.C19H21N
Mol. Mass.263.3767
SMILESCNCCCC1c2ccccc2C=Cc2ccccc12