Reaction Details
TargetGlycylpeptide N-tetradecanoyltransferase 1
LigandBDBM50384912
Substrate/Competitorn/a
Meas. Tech.ChEMBL_820572 (CHEMBL2040309)
Ki 19430±n/a nM
Citation Goncalves, VBrannigan, JAWhalley, DAnsell, KHSaxty, BHolder, AAWilkinson, AJTate, EWLeatherbarrow, RJ Discovery of Plasmodium vivax N-myristoyltransferase inhibitors: screening, synthesis, and structural characterization of their binding mode. J Med Chem55:3578-82 (2012) 
 
Glycylpeptide N-tetradecanoyltransferase 1
Name:Glycylpeptide N-tetradecanoyltransferase 1
Type:Enzyme
Mol. Mass.:56814.10
Organism:Homo sapiens (Human)
Description:P30419
Residue:496
BDBM50384912
NameBDBM50384912
Synonyms:CHEMBL2036502
TypeSmall organic molecule
Emp. Form.C16H16N2O3S
Mol. Mass.316.375
SMILESCCOC(=O)c1cnc2ccc(OC)cc2c1SCCC#N