Reaction Details
TargetGlycylpeptide N-tetradecanoyltransferase 1
LigandBDBM50384914
Substrate/Competitorn/a
Meas. Tech.ChEMBL_820572 (CHEMBL2040309)
Ki 1690±n/a nM
Citation Goncalves, VBrannigan, JAWhalley, DAnsell, KHSaxty, BHolder, AAWilkinson, AJTate, EWLeatherbarrow, RJ Discovery of Plasmodium vivax N-myristoyltransferase inhibitors: screening, synthesis, and structural characterization of their binding mode. J Med Chem55:3578-82 (2012) 
 
Glycylpeptide N-tetradecanoyltransferase 1
Name:Glycylpeptide N-tetradecanoyltransferase 1
Type:Enzyme
Mol. Mass.:56814.10
Organism:Homo sapiens (Human)
Description:P30419
Residue:496
BDBM50384914
NameBDBM50384914
Synonyms:CHEMBL2036496 | CHEMBL2079453
TypeSmall organic molecule
Emp. Form.C18H22N2OS
Mol. Mass.314.445
SMILESCCCCc1c(C)nc2ccc(OC)cc2c1SCCC#N