Reaction Details
TargetGlycylpeptide N-tetradecanoyltransferase 2
LigandBDBM50384917
Substrate/Competitorn/a
Meas. Tech.ChEMBL_820573 (CHEMBL2040310)
Ki 94170±n/a nM
Citation Goncalves, VBrannigan, JAWhalley, DAnsell, KHSaxty, BHolder, AAWilkinson, AJTate, EWLeatherbarrow, RJ Discovery of Plasmodium vivax N-myristoyltransferase inhibitors: screening, synthesis, and structural characterization of their binding mode. J Med Chem55:3578-82 (2012) 
 
Glycylpeptide N-tetradecanoyltransferase 2
Name:Glycylpeptide N-tetradecanoyltransferase 2
Type:PROTEIN
Mol. Mass.:56986.61
Organism:Homo sapiens (Human)
Description:ChEMBL_1435042
Residue:498
BDBM50384917
NameBDBM50384917
Synonyms:CHEMBL2036505
TypeSmall organic molecule
Emp. Form.C17H18N2O2S
Mol. Mass.314.402
SMILESCCOC(=O)c1c(CC)nc2ccccc2c1SCCC#N