Reaction Details
TargetGlycylpeptide N-tetradecanoyltransferase 1
LigandBDBM50384923
Substrate/Competitorn/a
Meas. Tech.ChEMBL_820572 (CHEMBL2040309)
Ki 33480±n/a nM
Citation Goncalves, VBrannigan, JAWhalley, DAnsell, KHSaxty, BHolder, AAWilkinson, AJTate, EWLeatherbarrow, RJ Discovery of Plasmodium vivax N-myristoyltransferase inhibitors: screening, synthesis, and structural characterization of their binding mode. J Med Chem55:3578-82 (2012) 
 
Glycylpeptide N-tetradecanoyltransferase 1
Name:Glycylpeptide N-tetradecanoyltransferase 1
Type:Enzyme
Mol. Mass.:56814.10
Organism:Homo sapiens (Human)
Description:P30419
Residue:496
BDBM50384923
NameBDBM50384923
Synonyms:CHEMBL2036636
TypeSmall organic molecule
Emp. Form.C15H13FN2O2S
Mol. Mass.304.339
SMILESCCOC(=O)c1cnc2ccc(F)cc2c1SCCC#N