Reaction Details
TargetAldo-keto reductase family 1 member C4
LigandBDBM50029207
Substrate/Competitorn/a
Meas. Tech.ChEMBL_821632 (CHEMBL2038587)
IC50 2300±n/a nM
Citation Endo, SMatsunaga, TKanamori, AOtsuji, YNagai, HSundaram, KEl-Kabbani, OToyooka, NOhta, SHara, A Selective inhibition of human type-5 17ß-hydroxysteroid dehydrogenase (AKR1C3) by baccharin, a component of Brazilian propolis. J Nat Prod75:716-21 (2012) 
 
Aldo-keto reductase family 1 member C4
Name:Aldo-keto reductase family 1 member C4
Type:Enzyme
Mol. Mass.:37068.40
Organism:Homo sapiens (Human)
Description:P17516
Residue:323
BDBM50029207
NameBDBM50029207
Synonyms:(E)-3-(3,4-Dihydroxy-phenyl)-acrylic acid phenethyl ester 3-(3,4-Dihydroxy-phenyl)-acrylic acid phenethyl ester CHEMBL319244 caffeic acid phenethylester caffeic acid phenylethylester phenethyl 3-(3,4-dihydroxyphenyl)acrylate | phenethyl caffeate
TypeSmall organic molecule
Emp. Form.C17H16O4
Mol. Mass.284.3065
SMILESOc1ccc(\C=C\C(=O)OCCc2ccccc2)cc1O