Reaction Details
TargetBotulinum neurotoxin type A
LigandBDBM50384440
Substrate/Competitorn/a
Meas. Tech.ChEMBL_821371 (CHEMBL2040354)
Ki 572±n/a nM
Citation Opsenica, IFilipovic, VNuss, JEGomba, LMOpsenica, DBurnett, JCGussio, RSolaja, BABavari, S The synthesis of 2,5-bis(4-amidinophenyl)thiophene derivatives providing submicromolar-range inhibition of the botulinum neurotoxin serotype A metalloprotease. Eur J Med Chem53:374-9 (2012) 
 
Botulinum neurotoxin type A
Name:Botulinum neurotoxin type A
Type:PROTEIN
Mol. Mass.:149450.01
Organism:Clostridium botulinum
Description:ChEMBL_1510137
Residue:1296
BDBM50384440
NameBDBM50384440
Synonyms:CHEMBL2035505 | CHEMBL2037389
TypeSmall organic molecule
Emp. Form.C52H48Cl2N12O4
Mol. Mass.975.922
SMILESClc1ccc2c(NCCCNC(=O)c3cc(NC(=O)c4ccc(cc4)C(=O)Nc4cc(cc(c4)C4=NCCN4)C(=O)NCCCNc4ccnc5cc(Cl)ccc45)cc(c3)C3=NCCN3)ccnc2c1