Reaction Details
TargetSodium-dependent serotonin transporter
LigandBDBM50151982
Substrate/Competitorn/a
Meas. Tech.ChEMBL_821406 (CHEMBL2037807)
Ki 0.5±n/a nM
Citation Zhu, XYEtukala, JREyunni, SVSetola, VRoth, BLAblordeppey, SY Benzothiazoles as probes for the 5HT1A receptor and the serotonin transporter (SERT): a search for new dual-acting agents as potential antidepressants. Eur J Med Chem53:124-32 (2012) 
 
Sodium-dependent serotonin transporter
Name:Sodium-dependent serotonin transporter
Type:Multi-pass membrane protein
Mol. Mass.:70322.51
Organism:Homo sapiens (Human)
Description:P31645
Residue:630
BDBM50151982
NameBDBM50151982
Synonyms:5-{4-[4-(5-Cyano-1H-indol-3-yl)-butyl]-piperazin-1-yl}-benzofuran-2-carboxylic acid amide VILAZODONE
TypeSmall organic molecule
Emp. Form.C26H27N5O2
Mol. Mass.441.5249
SMILESNC(=O)c1cc2cc(ccc2o1)N1CCN(CCCCc2c[nH]c3ccc(cc23)C#N)CC1