Reaction Details
TargetD(4) dopamine receptor
LigandBDBM50384954
Substrate/Competitorn/a
Meas. Tech.ChEMBL_820695 (CHEMBL2037966)
Ki 0.8±n/a nM
Citation Zhu, XYEtukala, JREyunni, SVSetola, VRoth, BLAblordeppey, SY Benzothiazoles as probes for the 5HT1A receptor and the serotonin transporter (SERT): a search for new dual-acting agents as potential antidepressants. Eur J Med Chem53:124-32 (2012) 
 
D(4) dopamine receptor
Name:D(4) dopamine receptor
Type:Enzyme Catalytic Domain
Mol. Mass.:41307.65
Organism:RAT
Description:DOPAMINE D4.4 0 RAT::P30729
Residue:387
BDBM50384954
NameBDBM50384954
Synonyms:CHEMBL2037521
TypeSmall organic molecule
Emp. Form.C19H23N5S
Mol. Mass.353.484
SMILESC(CCc1nc2ccccc2s1)CN1CCN(CC1)c1ncccn1