Reaction Details
Target3-phosphoinositide-dependent protein kinase 1
LigandBDBM50384998
Substrate/Competitorn/a
Meas. Tech.ChEMBL_821086 (CHEMBL2039412)
IC50 6600±n/a nM
Citation Lauro, GMasullo, MPiacente, SRiccio, RBifulco, G Inverse Virtual Screening allows the discovery of the biological activity of natural compounds. Bioorg Med Chem20:3596-602 (2012) 
 
3-phosphoinositide-dependent protein kinase 1
Name:3-phosphoinositide-dependent protein kinase 1
Type:Enzyme
Mol. Mass.:63157.65
Organism:Homo sapiens (Human)
Description:O15530
Residue:556
BDBM50384998
NameBDBM50384998
Synonyms:CVD-0019905 | XANTHOHUMOL
TypeSmall organic molecule
Emp. Form.C21H22O5
Mol. Mass.354.3964
SMILES[#6]-[#8]-c1cc(-[#8])c(-[#6]\[#6]=[#6](/[#6])-[#6])c(-[#8])c1-[#6](=O)\[#6]=[#6]\c1ccc(-[#8])cc1