Reaction Details
TargetSerine/threonine-protein kinase pim-1
LigandBDBM50385084
Substrate/Competitorn/a
Meas. Tech.ChEMBL_821478 (CHEMBL2038008)
IC50 3±n/a nM
Citation Tsuhako, ALBrown, DSKoltun, ESAay, NArcalas, AChan, VDu, HEngst, SFranzini, MGalan, AHuang, PJohnston, SKane, BKim, MHLaird, ADLin, RMock, LNgan, IPack, MStott, GStout, TJYu, PZaharia, CZhang, WZhou, PNuss, JMKearney, PCXu, W The design, synthesis, and biological evaluation of PIM kinase inhibitors. Bioorg Med Chem Lett22:3732-8 (2012) 
 
Serine/threonine-protein kinase pim-1
Name:Serine/threonine-protein kinase pim-1
Type:Protein
Mol. Mass.:35681.82
Organism:Homo sapiens (Human)
Description:P11309
Residue:313
BDBM50385084
NameBDBM50385084
Synonyms:CHEMBL2035636
TypeSmall organic molecule
Emp. Form.C18H19BrN4O2
Mol. Mass.403.273
SMILESCN1C[C@@H]2CC[C@H]1CN2Cc1nc2c3cc(Br)ccc3oc2c(=O)[nH]1