Reaction Details
TargetThyroid hormone receptor beta
LigandBDBM50385105
Substrate/Competitorn/a
Meas. Tech.ChEMBL_821529 (CHEMBL2038197)
Ki 0.43±n/a nM
Citation Shiohara, HNakamura, TKikuchi, NOzawa, TNagano, RMatsuzawa, AOhnota, HMiyamoto, TIchikawa, KHashizume, K Discovery of novel indane derivatives as liver-selective thyroid hormone receptorß (TRß) agonists for the treatment of dyslipidemia. Bioorg Med Chem20:3622-34 (2012) 
 
Thyroid hormone receptor beta
Name:Thyroid hormone receptor beta
Type:Receptor
Mol. Mass.:52793.62
Organism:Homo sapiens (Human)
Description:Recombinant hThR was obtained from nuclear extracts from SF9 cells infected with baculovirus vectors encoding for ThRbeta 1.
Residue:461
BDBM50385105
NameBDBM50385105
Synonyms:CHEMBL2035874 | US10322118, Entry 8b
TypeSmall organic molecule
Emp. Form.C18H17Br2NO5
Mol. Mass.487.139
SMILESCC(C)c1cc(Oc2c(Br)cc(NC(=O)CC(O)=O)cc2Br)ccc1O