Reaction Details
TargetThyroid hormone receptor alpha
LigandBDBM50385101
Substrate/Competitorn/a
Meas. Tech.ChEMBL_821530 (CHEMBL2038198)
Ki 24.4±n/a nM
Citation Shiohara, HNakamura, TKikuchi, NOzawa, TNagano, RMatsuzawa, AOhnota, HMiyamoto, TIchikawa, KHashizume, K Discovery of novel indane derivatives as liver-selective thyroid hormone receptorß (TRß) agonists for the treatment of dyslipidemia. Bioorg Med Chem20:3622-34 (2012) 
 
Thyroid hormone receptor alpha
Name:Thyroid hormone receptor alpha
Type:Receptor
Mol. Mass.:54818.00
Organism:Homo sapiens (Human)
Description:Recombinant hThR was obtained from nuclear extracts from SF9 cells infected with baculovirus vectors encoding for ThRalpha 1.
Residue:490
BDBM50385101
NameBDBM50385101
Synonyms:CHEMBL2035876
TypeSmall organic molecule
Emp. Form.C18H16Cl3NO5
Mol. Mass.432.682
SMILESCC(C)c1cc(Oc2c(Cl)cc(NC(=O)CC(O)=O)c(Cl)c2Cl)ccc1O