Reaction Details
TargetProstaglandin E2 receptor EP2 subtype
LigandBDBM50385128
Substrate/Competitorn/a
Meas. Tech.ChEMBL_822927 (CHEMBL2038098)
Ki 2±n/a nM
Citation Kambe, TMaruyama, TNakai, YOida, HMaruyama, TAbe, NNishiura, ANakai, HToda, M Synthesis and evaluation of¿-lactam analogs of PGE2 as EP4 and EP2/EP4 agonists. Bioorg Med Chem20:3502-22 (2012) 
 
Prostaglandin E2 receptor EP2 subtype
Name:Prostaglandin E2 receptor EP2 subtype
Type:G-protein coupled receptor
Mol. Mass.:40495.26
Organism:Mus musculus (Mouse)
Description:n/a
Residue:362
BDBM50385128
NameBDBM50385128
Synonyms:CHEMBL2036318
TypeSmall organic molecule
Emp. Form.C27H28N2O4S2
Mol. Mass.508.652
SMILESCc1ccc(cc1)-c1cccc(C[C@H](O)\C=C\[C@H]2CCC(=O)N2CCSc2nc(cs2)C(O)=O)c1