Reaction Details
TargetProstaglandin E2 receptor EP4 subtype
LigandBDBM50385131
Substrate/Competitorn/a
Meas. Tech.ChEMBL_822929 (CHEMBL2038100)
Ki 0.12±n/a nM
Citation Kambe, TMaruyama, TNakai, YOida, HMaruyama, TAbe, NNishiura, ANakai, HToda, M Synthesis and evaluation of¿-lactam analogs of PGE2 as EP4 and EP2/EP4 agonists. Bioorg Med Chem20:3502-22 (2012) 
 
Prostaglandin E2 receptor EP4 subtype
Name:Prostaglandin E2 receptor EP4 subtype
Type:G-protein coupled receptor
Mol. Mass.:56175.66
Organism:Mus musculus (Mouse)
Description:n/a
Residue:513
BDBM50385131
NameBDBM50385131
Synonyms:CHEMBL2036322
TypeSmall organic molecule
Emp. Form.C28H26N2O5S2
Mol. Mass.534.646
SMILESO[C@@H](Cc1cccc(c1)-c1cc2ccccc2o1)\C=C\[C@H]1CCC(=O)N1CCSc1nc(cs1)C(O)=O