Reaction Details
TargetProstaglandin E2 receptor EP4 subtype
LigandBDBM50385133
Substrate/Competitorn/a
Meas. Tech.ChEMBL_822929 (CHEMBL2038100)
Ki 0.19±n/a nM
Citation Kambe, TMaruyama, TNakai, YOida, HMaruyama, TAbe, NNishiura, ANakai, HToda, M Synthesis and evaluation of¿-lactam analogs of PGE2 as EP4 and EP2/EP4 agonists. Bioorg Med Chem20:3502-22 (2012) 
 
Prostaglandin E2 receptor EP4 subtype
Name:Prostaglandin E2 receptor EP4 subtype
Type:G-protein coupled receptor
Mol. Mass.:56175.66
Organism:Mus musculus (Mouse)
Description:n/a
Residue:513
BDBM50385133
NameBDBM50385133
Synonyms:CHEMBL2036324
TypeSmall organic molecule
Emp. Form.C27H25N3O4S3
Mol. Mass.551.7
SMILESO[C@@H](Cc1cccc(c1)-c1nc2ccccc2s1)\C=C\[C@H]1CCC(=O)N1CCSc1nc(cs1)C(O)=O