Reaction Details
TargetProstaglandin E2 receptor EP4 subtype
LigandBDBM50385138
Substrate/Competitorn/a
Meas. Tech.ChEMBL_822929 (CHEMBL2038100)
Ki 0.15±n/a nM
Citation Kambe, TMaruyama, TNakai, YOida, HMaruyama, TAbe, NNishiura, ANakai, HToda, M Synthesis and evaluation of¿-lactam analogs of PGE2 as EP4 and EP2/EP4 agonists. Bioorg Med Chem20:3502-22 (2012) 
 
Prostaglandin E2 receptor EP4 subtype
Name:Prostaglandin E2 receptor EP4 subtype
Type:G-protein coupled receptor
Mol. Mass.:56175.66
Organism:Mus musculus (Mouse)
Description:n/a
Residue:513
BDBM50385138
NameBDBM50385138
Synonyms:CHEMBL2037291
TypeSmall organic molecule
Emp. Form.C29H29N3O5S2
Mol. Mass.563.688
SMILESCc1cc(C)c2oc(nc2c1)-c1cccc(C[C@H](O)\C=C\[C@H]2CCC(=O)N2CCSc2nc(cs2)C(O)=O)c1