Reaction Details
TargetPeroxisome proliferator-activated receptor alpha
LigandBDBM50168557
Substrate/Competitorn/a
Meas. Tech.ChEMBL_822292 (CHEMBL2038446)
IC50 16±n/a nM
Citation Méndez-Lucio, OPérez-Villanueva, JCastillo, RMedina-Franco, JL Activity landscape modeling of PPAR ligands with dual-activity difference maps. Bioorg Med Chem20:3523-32 (2012) 
 
Peroxisome proliferator-activated receptor alpha
Name:Peroxisome proliferator-activated receptor alpha
Type:Enzyme
Mol. Mass.:52222.08
Organism:Homo sapiens (Human)
Description:Q07869
Residue:468
BDBM50168557
NameBDBM50168557
Synonyms:(R)-7-[3-(2-Chloro-4-isobutyl-phenoxy)-propoxy]-2-methyl-chroman-2-carboxylic acid | CHEMBL180019
TypeSmall organic molecule
Emp. Form.C24H29ClO5
Mol. Mass.432.937
SMILESCC(C)Cc1ccc(OCCCOc2ccc3CC[C@@](C)(Oc3c2)C(O)=O)c(Cl)c1