Reaction Details
TargetPeroxisome proliferator-activated receptor alpha
LigandBDBM50184274
Substrate/Competitorn/a
Meas. Tech.ChEMBL_822292 (CHEMBL2038446)
IC50 16±n/a nM
Citation Méndez-Lucio, OPérez-Villanueva, JCastillo, RMedina-Franco, JL Activity landscape modeling of PPAR ligands with dual-activity difference maps. Bioorg Med Chem20:3523-32 (2012) 
 
Peroxisome proliferator-activated receptor alpha
Name:Peroxisome proliferator-activated receptor alpha
Type:Enzyme
Mol. Mass.:52222.08
Organism:Homo sapiens (Human)
Description:Q07869
Residue:468
BDBM50184274
NameBDBM50184274
Synonyms:2-(4-(3-(7-propyl-3-(trifluoromethyl)benzo[d]isoxazol-6-yloxy)propylamino)phenyl)acetic acid | CHEMBL207103
TypeSmall organic molecule
Emp. Form.C22H23F3N2O4
Mol. Mass.436.4242
SMILESCCCc1c(OCCCNc2ccc(CC(O)=O)cc2)ccc2c(noc12)C(F)(F)F