Reaction Details
TargetPeroxisome proliferator-activated receptor alpha
LigandBDBM50184261
Substrate/Competitorn/a
Meas. Tech.ChEMBL_822292 (CHEMBL2038446)
IC50 19.01±n/a nM
Citation Méndez-Lucio, OPérez-Villanueva, JCastillo, RMedina-Franco, JL Activity landscape modeling of PPAR ligands with dual-activity difference maps. Bioorg Med Chem20:3523-32 (2012) 
 
Peroxisome proliferator-activated receptor alpha
Name:Peroxisome proliferator-activated receptor alpha
Type:Enzyme
Mol. Mass.:52222.08
Organism:Homo sapiens (Human)
Description:Q07869
Residue:468
BDBM50184261
NameBDBM50184261
Synonyms:2-(4-(3-(7-propyl-3-(trifluoromethyl)benzo[d]isoxazol-6-yloxy)propoxy)phenyl)acetic acid | CHEMBL210973
TypeSmall organic molecule
Emp. Form.C22H22F3NO5
Mol. Mass.437.409
SMILESCCCc1c(OCCCOc2ccc(CC(O)=O)cc2)ccc2c(noc12)C(F)(F)F