Reaction Details
TargetHistamine H3 receptor
LigandBDBM50385250
Substrate/Competitorn/a
Meas. Tech.ChEMBL_822385 (CHEMBL2038933)
Ki 5±n/a nM
Citation Becknell, NCLyons, JAAimone, LDHuang, ZGruner, JARaddatz, RHudkins, RL Synthesis and evaluation of 4- and 5-pyridazin-3-one phenoxypropylamine analogues as histamine-3 receptor antagonists. Bioorg Med Chem20:3880-6 (2012) 
 
Histamine H3 receptor
Name:Histamine H3 receptor
Type:G Protein-Coupled Receptor (GPCR)
Mol. Mass.:48691.47
Organism:Homo sapiens (Human)
Description:Binding assays were using CHO cells stably expressing hH3R receptors.
Residue:445
BDBM50385250
NameBDBM50385250
Synonyms:CHEMBL2037609
TypeSmall organic molecule
Emp. Form.C21H29N3O4
Mol. Mass.387.4727
SMILESCOCn1ncc(-c2ccc(OCCCN3CCC[C@H]3C)cc2)c(OC)c1=O