Reaction Details
TargetHistamine H2 receptor
LigandBDBM50385243
Substrate/Competitorn/a
Meas. Tech.ChEMBL_822395 (CHEMBL2038943)
Ki>10000±n/a nM
Citation Becknell, NCLyons, JAAimone, LDHuang, ZGruner, JARaddatz, RHudkins, RL Synthesis and evaluation of 4- and 5-pyridazin-3-one phenoxypropylamine analogues as histamine-3 receptor antagonists. Bioorg Med Chem20:3880-6 (2012) 
 
Histamine H2 receptor
Name:Histamine H2 receptor
Type:G Protein-Coupled Receptor (GPCR)
Mol. Mass.:40115.31
Organism:Homo sapiens (Human)
Description:n/a
Residue:359
BDBM50385243
NameBDBM50385243
Synonyms:CHEMBL2037608
TypeSmall organic molecule
Emp. Form.C20H27N3O3
Mol. Mass.357.4467
SMILESCOCn1ncc(cc1=O)-c1ccc(OCCCN2CCC[C@H]2C)cc1