Reaction Details
TargetHistamine H4 receptor
LigandBDBM50385246
Substrate/Competitorn/a
Meas. Tech.ChEMBL_822396 (CHEMBL2038944)
Ki>10000±n/a nM
Citation Becknell, NCLyons, JAAimone, LDHuang, ZGruner, JARaddatz, RHudkins, RL Synthesis and evaluation of 4- and 5-pyridazin-3-one phenoxypropylamine analogues as histamine-3 receptor antagonists. Bioorg Med Chem20:3880-6 (2012) 
 
Histamine H4 receptor
Name:Histamine H4 receptor
Type:G Protein-Coupled Receptor (GPCR)
Mol. Mass.:44517.02
Organism:Homo sapiens (Human)
Description:Binding assays were using CHO cells stably expressing hH4R receptors.
Residue:390
BDBM50385246
NameBDBM50385246
Synonyms:CHEMBL2037604
TypeSmall organic molecule
Emp. Form.C19H25N3O2
Mol. Mass.327.4207
SMILESC[C@H](COc1ccc(cc1)-c1cn[nH]c(=O)c1)CN1CCC[C@H]1C