Reaction Details
TargetCytochrome P450 3A4
LigandBDBM50385243
Substrate/Competitorn/a
Meas. Tech.ChEMBL_822405 (CHEMBL2038953)
IC50>30000±n/a nM
Citation Becknell, NCLyons, JAAimone, LDHuang, ZGruner, JARaddatz, RHudkins, RL Synthesis and evaluation of 4- and 5-pyridazin-3-one phenoxypropylamine analogues as histamine-3 receptor antagonists. Bioorg Med Chem20:3880-6 (2012) 
 
Cytochrome P450 3A4
Name:Cytochrome P450 3A4
Type:Enzyme
Mol. Mass.:57349.57
Organism:Homo sapiens (Human)
Description:n/a
Residue:503
BDBM50385243
NameBDBM50385243
Synonyms:CHEMBL2037608
TypeSmall organic molecule
Emp. Form.C20H27N3O3
Mol. Mass.357.4467
SMILESCOCn1ncc(cc1=O)-c1ccc(OCCCN2CCC[C@H]2C)cc1