Reaction Details
TargetPenicillin-binding protein 2X
LigandBDBM50385267
Substrate/Competitorn/a
Meas. Tech.ChEMBL_822530 (CHEMBL2039463)
IC50 278000±n/a nM
Citation Zervosen, ABouillez, AHerman, AAmoroso, AJoris, BSauvage, ECharlier, PLuxen, A Synthesis and evaluation of boronic acids as inhibitors of Penicillin Binding Proteins of classes A, B and C. Bioorg Med Chem20:3915-24 (2012) 
 
Penicillin-binding protein 2X
Name:Penicillin-binding protein 2X
Type:PROTEIN
Mol. Mass.:82337.09
Organism:Streptococcus pneumoniae R6
Description:ChEMBL_822530
Residue:750
BDBM50385267
NameBDBM50385267
Synonyms:CHEMBL2035284
TypeSmall organic molecule
Emp. Form.C10H14BNO5
Mol. Mass.239.033
SMILESCOc1cccc(OC)c1C(=O)NCB(O)O