Reaction Details
TargetThioredoxin reductase 1, cytoplasmic
LigandBDBM50385273
Substrate/Competitorn/a
Meas. Tech.ChEMBL_822563 (CHEMBL2039583)
IC50 320±n/a nM
Citation He, JLi, DXiong, KGe, YJin, HZhang, GHong, MTian, YYin, JZeng, H Inhibition of thioredoxin reductase by a novel series of bis-1,2-benzisoselenazol-3(2H)-ones: Organoselenium compounds for cancer therapy. Bioorg Med Chem20:3816-27 (2012) 
 
Thioredoxin reductase 1, cytoplasmic
Name:Thioredoxin reductase 1, cytoplasmic
Type:PROTEIN
Mol. Mass.:54519.34
Organism:Rattus norvegicus
Description:ChEMBL_589950
Residue:498
BDBM50385273
NameBDBM50385273
Synonyms:CHEMBL2035491
TypeSmall organic molecule
Emp. Form.C16H12N2O4Se2
Mol. Mass.454.2
SMILESOc1ccc2[se]n(CCn3[se]c4ccc(O)cc4c3=O)c(=O)c2c1